{"text_format":"1","workbook":"xlsx","n_sheets":11,"sheets":["Front Page","Disclaimer","RAG ","Option 1 OAN ","Option 2 London Plan","Policy 43 Man COU Nonshop Front","Policy 46 Pro of Particular Use","Policy 52 Making Safer Places ","Summary table","Summary","Pivot Chart"],"not_rendered":{"charts":1,"images":4,"macros":1,"external_links":38,"defined_names":63,"comments":0,"pivot_tables":1},"unopened":[],"bounds":{"document_bytes":16777216,"sheet_cells":100000,"rows_first":2000,"rows_last":500,"rows_between":2000,"halvings":0,"cell_chars":16384,"cell_head_chars":4096},"cells_cut":0,"cells_raw":0,"read":"whole","date_system":"1900"}

{"sheet":"Front Page","index":0,"n_rows":30,"n_cols":11,"rows_kept":30,"cut":false,"hidden":false,"merged":[[9,2,10,10],[15,2,15,10],[14,2,14,10],[13,2,13,10]]}
[]
[]
[]
[]
[]
[]
{"$rows_left_out":25}
{"sheet":"Disclaimer","index":1,"n_rows":41,"n_cols":7,"rows_kept":41,"cut":false,"hidden":false,"merged":[[21,2,34,6],[37,1,37,2],[37,6,37,7],[40,6,40,7],[40,1,40,2],[38,1,38,2],[38,6,38,7],[39,1,39,2],[39,6,39,7]]}
[]
[]
[]
[]
[null,null,null,"Contract  No:","C0093"]
[]
{"$rows_left_out":36}
{"sheet":"RAG ","index":2,"n_rows":33,"n_cols":5,"rows_kept":33,"cut":false,"hidden":true,"merged":[[23,1,24,1],[25,1,26,1],[31,1,32,1],[2,1,3,1],[4,1,10,1],[19,1,20,1],[21,1,22,1],[27,1,29,1],[11,1,14,1],[15,1,17,1]]}
[]
[null,"SA Objective","Indicator","RAG Criteria","Justification"]
[null,"SA 3: Improve standard of health and wellbeing of those who live and work in the Borough ","Proximity to a GPs/Health centre/hospital",">800m \n400-800m\n<400m","CIHT Planning for Walking Guidelines, 2015 "]
[null,null,"Proximity to recreational facilities ",">800m \n400-800m\n<400m","CIHT Planning for Walking Guidelines, 2015 "]
[null,"SA4. Improve community cohesion and reduce inequalities through the provision of community facilities to meet local cultural, educational, recreational and social needs ","Proximity to a Town, Local, Neighbourhood or District Centres",">0.8km walking distance \n<0.8km walking distance\n<0.4km walking distance\n<0.2km walking distance","CIHT Planning for Walking Guidelines, 2015 "]
[null,null,"Proximity to a primary school",">3.2km \n<3.2km\n<1km","Home to School Transport and Travel Guidance, 2014 "]
{"$rows_left_out":28}
{"sheet":"Option 1 OAN ","index":3,"n_rows":30,"n_cols":19,"rows_kept":30,"cut":false,"hidden":false,"merged":[[28,1,28,8],[29,1,29,8],[1,2,1,8],[2,2,2,8],[24,1,24,8],[25,1,25,8],[26,1,26,8],[27,1,27,8]]}
[]
[null,"Option Name:","Option 1 OAN Scale of Growth ( LP1 Policy 2)"]
[null,"Assumptions:","None. ",null,null,null,null,null,null,null,null,null,null,"Direct","Short","Permanent/ Irreversible",null,null,"Significant Positive"]
[null,"SA Objective","Key Sustainability Issues","Description of Impact (Including Effects on Receptor and Effects on Key Sustainability Issues)","Direct/ Indirect/ Cumulative","Duration (short, medium, long term)","Permanent/ Temporary Irreversible/ Reversible","Spatial Extent / Magnitude","Significance",null,null,null,null,"Indirect","Medium","Permanent/ Reversible",null,null,"Significant Negative"]
[null,"SA1. Meet local housing needs through the provision of a range of tenures and sizes of new dwellings \n","As the population continues to increase so does the demand for housing, infrastructure and facilities. \n\nThe population density within the Borough exceeds both the London and the national averages.\n\nThere is a need to create high quality places to live, work and recreate that are mixed and well-balanced in terms of tenure and income.\n\nPromote high quality housing with a range of tenures to reduce health issues which arise from poor quality accommodation.\n\nThere is a disparity between the cost of housing and the amount that people are able to borrow to purchase a home, which means that many people are unable to access the property market.\n\nThere is a shortfall in the provision of affordable housing to meet the requirements of those in housing need.\n\n28% of households are unsuitably housed; there is a potential shortfall in the provision of family accommodation and there is overcrowding, primarily in the private rental sector.\n\nHomelessness is expected to increase.\n\nNeed to offer greater quality, flexibility and choice to those who rent.\n\nThere is a need to increase the supply of well-designed housing of all tenures.\n\nNeed to introduce more flexible approaches for affordable housing contributions to encourage open market and mixed tenure specialist older people’s housing.","The option sets out a scale of growth across the Borough and includes a minimum net increase of housing to be planned for and provided which is a minimum of 27,000 additional homes.  The policy therefore supports the achievement of this objective and addresses key sustainability issues.  It is considered to have a significant positive effect.  ","Direct","Medium/ Long","Permanent/ Irreversible","Local/ High","Significant Positive",null,null,null,null,"Cumulative","Long","Temporary/ Irreversible",null,null,"Minor Positive"]
[null,"SA2. Reduce crime and the fear of crime ","Increases in racist and religious hate crimes.\n\nThe percentage of residents that are worried about crime in the Borough remains higher than the London average.\n\nNeed to provide safe and accessible environments where crime and disorder, and the fear of crime, do not undermine quality of life.\n\nNeed to develop an approach to tackling crime, improving liveability and reducing anti-social behaviour.","The policy neither supports nor detracts from the achievement of the SA objective.  A specific policy in the Local Plan (policy 60 Designing out crime) should address this SA objective. Therefore a neutral effect is predicted.  ","N/A","N/A","N/A","N/A","Neutral",null,null,null,null,"N/A","Short/ Medium","Temporary/ Reversible",null,null,"Minor Negative"]
{"$rows_left_out":25}
{"sheet":"Option 2 London Plan","index":4,"n_rows":30,"n_cols":19,"rows_kept":30,"cut":false,"hidden":false,"merged":[[28,1,28,8],[29,1,29,8],[1,2,1,8],[2,2,2,8],[24,1,24,8],[25,1,25,8],[26,1,26,8],[27,1,27,8]]}
[]
[null,"Option Name:","Option 2 London Plan "]
[null,"Assumptions:","None. ",null,null,null,null,null,null,null,null,null,null,"Direct","Short","Permanent/ Irreversible",null,null,"Significant Positive"]
[null,"SA Objective","Key Sustainability Issues","Description of Impact (Including Effects on Receptor and Effects on Key Sustainability Issues)","Direct/ Indirect/ Cumulative","Duration (short, medium, long term)","Permanent/ Temporary Irreversible/ Reversible","Spatial Extent / Magnitude","Significance",null,null,null,null,"Indirect","Medium","Permanent/ Reversible",null,null,"Significant Negative"]
[null,"SA1. Meet local housing needs through the provision of a range of tenures and sizes of new dwellings \n","As the population continues to increase so does the demand for housing, infrastructure and facilities. \n\nThe population density within the Borough exceeds both the London and the national averages.\n\nThere is a need to create high quality places to live, work and recreate that are mixed and well-balanced in terms of tenure and income.\n\nPromote high quality housing with a range of tenures to reduce health issues which arise from poor quality accommodation.\n\nThere is a disparity between the cost of housing and the amount that people are able to borrow to purchase a home, which means that many people are unable to access the property market.\n\nThere is a shortfall in the provision of affordable housing to meet the requirements of those in housing need.\n\n28% of households are unsuitably housed; there is a potential shortfall in the provision of family accommodation and there is overcrowding, primarily in the private rental sector.\n\nHomelessness is expected to increase.\n\nNeed to offer greater quality, flexibility and choice to those who rent.\n\nThere is a need to increase the supply of well-designed housing of all tenures.\n\nNeed to introduce more flexible approaches for affordable housing contributions to encourage open market and mixed tenure specialist older people’s housing.","This alterantive policy would deliver a scale of growth equal to the London Plan requirement for the borough, which is 12,640 or 1,264 dwellings per year over the ten year period 2019/20 to 2028/29. It is assumed that this annual requirement would be extended by 6 years to the end of the Local Plan period (2035) therefore delivering a total of 20,224. However, the LBWF Council's evidence base identifies that the Council’s objectively assessed need (OAN) for homes is 1,810 dwellings per annum, which over the 15 years plan period equates to approximately 27,000 new homes. The key evidence document is the Strategic Housing Market Assessment (SHMA, 2019). Although this alternative would provide 18,960 homes over a 15 year period, it would fall short of the housing need for the borough identified by the evidence base by circa 8,000 homes A significant negative effect is identified as this alternative would not meet the local housing need and could exacerbate key sustainability issues.    ","Direct","Medium/ Long","Permanent/ Reversible","Local/ High","Significant Negative",null,null,null,null,"Cumulative","Long","Temporary/ Irreversible",null,null,"Minor Positive"]
[null,"SA2. Reduce crime and the fear of crime ","Increases in racist and religious hate crimes.\n\nThe percentage of residents that are worried about crime in the Borough remains higher than the London average.\n\nNeed to provide safe and accessible environments where crime and disorder, and the fear of crime, do not undermine quality of life.\n\nNeed to develop an approach to tackling crime, improving liveability and reducing anti-social behaviour.","The alternative neither supports nor detracts from the achievement of the SA objective.  A specific policy in the Local Plan (policy 60 Designing out crime) should address this SA objective. Therefore a neutral effect is predicted.  ","N/A","N/A","N/A","N/A","Neutral",null,null,null,null,"N/A","Short/ Medium","Temporary/ Reversible",null,null,"Minor Negative"]
{"$rows_left_out":25}
{"sheet":"Policy 43 Man COU Nonshop Front","index":5,"n_rows":30,"n_cols":19,"rows_kept":30,"cut":false,"hidden":true,"merged":[[28,1,28,8],[29,1,29,8],[1,2,1,8],[2,2,2,8],[24,1,24,8],[25,1,25,8],[26,1,26,8],[27,1,27,8]]}
[]
[null,"Policy Name:","Managing Changes of Use Outside Primary Shopping Areas of Designated Centres - policy now merged with Policy 42"]
[null,"Assumptions:","None. ",null,null,null,null,null,null,null,null,null,null,"Direct","Short","Permanent/ Irreversible",null,null,"Significant Positive"]
[null,"SA Objective","Key Sustainability Issues","Description of Impact (Including Effects on Receptor and Effects on Key Sustainability Issues)","Direct/ Indirect/ Cumulative","Duration (short, medium, long term)","Permanent/ Temporary Irreversible/ Reversible","Spatial Extent / Magnitude","Significance",null,null,null,null,"Indirect","Medium","Permanent/ Reversible",null,null,"Significant Negative"]
[null,"SA1. Meet local housing needs through the provision of a range of tenures and sizes of new dwellings \n","As the population continues to increase so does the demand for housing, infrastructure and facilities. \n\nThe population density within the Borough exceeds both the London and the national averages.\n\nThere is a need to create high quality places to live, work and recreate that are mixed and well-balanced in terms of tenure and income.\n\nPromote high quality housing with a range of tenures to reduce health issues which arise from poor quality accommodation.\n\nThere is a disparity between the cost of housing and the amount that people are able to borrow to purchase a home, which means that many people are unable to access the property market.\n\nThere is a shortfall in the provision of affordable housing to meet the requirements of those in housing need.\n\n28% of households are unsuitably housed; there is a potential shortfall in the provision of family accommodation and there is overcrowding, primarily in the private rental sector.\n\nHomelessness is expected to increase.\n\nNeed to offer greater quality, flexibility and choice to those who rent.\n\nThere is a need to increase the supply of well-designed housing of all tenures.\n\nNeed to introduce more flexible approaches for affordable housing contributions to encourage open market and mixed tenure specialist older people’s housing.","The policy neither supports nor detracts from the achievement of the SA objective.  Therefore a neutral effect is predicted.  ","N/A","N/A","N/A","N/A","Neutral",null,null,null,null,"Cumulative","Long","Temporary/ Irreversible",null,null,"Minor Positive"]
[null,"SA2. Reduce crime and the fear of crime ","Increases in racist and religious hate crimes.\n\nThe percentage of residents that are worried about crime in the Borough remains higher than the London average.\n\nNeed to provide safe and accessible environments where crime and disorder, and the fear of crime, do not undermine quality of life.\n\nNeed to develop an approach to tackling crime, improving liveability and reducing anti-social behaviour.","The policy neither supports nor detracts from the achievement of the SA objective.  Therefore a neutral effect is predicted.  ","N/A","N/A","N/A","N/A","Neutral",null,null,null,null,"N/A","Short/ Medium","Temporary/ Reversible",null,null,"Minor Negative"]
{"$rows_left_out":25}
{"sheet":"Policy 46 Pro of Particular Use","index":6,"n_rows":30,"n_cols":19,"rows_kept":30,"cut":false,"hidden":true,"merged":[[28,1,28,8],[29,1,29,8],[1,2,1,8],[2,2,2,8],[24,1,24,8],[25,1,25,8],[26,1,26,8],[27,1,27,8]]}
[]
[null,"Policy Name:","Proliferation of Particular Uses Policy now deleted"]
[null,"Assumptions:","None. ",null,null,null,null,null,null,null,null,null,null,"Direct","Short","Permanent/ Irreversible",null,null,"Significant Positive"]
[null,"SA Objective","Key Sustainability Issues - NEEDS UPDATING AS PER POLICY 17","Description of Impact (Including Effects on Receptor and Effects on Key Sustainability Issues)","Direct/ Indirect/ Cumulative","Duration (short, medium, long term)","Permanent/ Temporary Irreversible/ Reversible","Spatial Extent / Magnitude","Significance",null,null,null,null,"Indirect","Medium","Permanent/ Reversible",null,null,"Significant Negative"]
[null,"SA1. Meet local housing needs through the provision of a range of tenures and sizes of new dwellings \n","As the population continues to increase so does the demand for housing, infrastructure and facilities. \n\nThe population density within the Borough exceeds both the London and the national averages.\n\nThere is a need to create high quality places to live, work and recreate that are mixed and well-balanced in terms of tenure and income.\n\nPromote high quality housing with a range of tenures to reduce health issues which arise from poor quality accommodation.\n\nThere is a disparity between the cost of housing and the amount that people are able to borrow to purchase a home, which means that many people are unable to access the property market.\n\nThere is a shortfall in the provision of affordable housing to meet the requirements of those in housing need.\n\n28% of households are unsuitably housed; there is a potential shortfall in the provision of family accommodation and there is overcrowding, primarily in the private rental sector.\n\nHomelessness is expected to increase.\n\nNeed to offer greater quality, flexibility and choice to those who rent.\n\nThere is a need to increase the supply of well-designed housing of all tenures.\n\nNeed to introduce more flexible approaches for affordable housing contributions to encourage open market and mixed tenure specialist older people’s housing.","The policy neither supports nor detracts from the achievement of the SA objective.  Therefore a neutral effect is predicted.  ","N/A","N/A","N/A","N/A","Neutral",null,null,null,null,"Cumulative","Long","Temporary/ Irreversible",null,null,"Minor Positive"]
[null,"SA2. Reduce crime and the fear of crime ","Increases in racist and religious hate crimes.\n\nThe percentage of residents that are worried about crime in the Borough remains higher than the London average.\n\nNeed to provide safe and accessible environments where crime and disorder, and the fear of crime, do not undermine quality of life.\n\nNeed to develop an approach to tackling crime, improving liveability and reducing anti-social behaviour.","The policy neither supports nor detracts from the achievement of the SA objective.  Therefore a neutral effect is predicted.  ","N/A","N/A","N/A","N/A","Neutral",null,null,null,null,"N/A","Short/ Medium","Temporary/ Reversible",null,null,"Minor Negative"]
{"$rows_left_out":25}
{"sheet":"Policy 52 Making Safer Places ","index":7,"n_rows":30,"n_cols":19,"rows_kept":30,"cut":false,"hidden":true,"merged":[[28,1,28,8],[29,1,29,8],[1,2,1,8],[2,2,2,8],[24,1,24,8],[25,1,25,8],[26,1,26,8],[27,1,27,8]]}
[]
[null,"Policy Name:","Making Safer Places - deleted"]
[null,"Assumptions:","None. ",null,null,null,null,null,null,null,null,null,null,"Direct","Short","Permanent/ Irreversible",null,null,"Significant Positive"]
[null,"SA Objective","Key Sustainability Issues ","Description of Impact (Including Effects on Receptor and Effects on Key Sustainability Issues)","Direct/ Indirect/ Cumulative","Duration (short, medium, long term)","Permanent/ Temporary Irreversible/ Reversible","Spatial Extent / Magnitude","Significance",null,null,null,null,"Indirect","Medium","Permanent/ Reversible",null,null,"Significant Negative"]
[null,"SA1. Meet local housing needs through the provision of a range of tenures and sizes of new dwellings \n","As the population continues to increase so does the demand for housing, infrastructure and facilities. \n\nThe population density within the Borough exceeds both the London and the national averages.\n\nThere is a need to create high quality places to live, work and recreate that are mixed and well-balanced in terms of tenure and income.\n\nPromote high quality housing with a range of tenures to reduce health issues which arise from poor quality accommodation.\n\nThere is a disparity between the cost of housing and the amount that people are able to borrow to purchase a home, which means that many people are unable to access the property market.\n\nThere is a shortfall in the provision of affordable housing to meet the requirements of those in housing need.\n\n28% of households are unsuitably housed; there is a potential shortfall in the provision of family accommodation and there is overcrowding, primarily in the private rental sector.\n\nHomelessness is expected to increase.\n\nNeed to offer greater quality, flexibility and choice to those who rent.\n\nThere is a need to increase the supply of well-designed housing of all tenures.\n\nNeed to introduce more flexible approaches for affordable housing contributions to encourage open market and mixed tenure specialist older people’s housing.","The policy neither supports nor detracts from the achievement of the SA objective.  Therefore a neutral effect is predicted.  ","N/A","N/A","N/A","N/A","Neutral",null,null,null,null,"Cumulative","Long","Temporary/ Irreversible",null,null,"Minor Positive"]
[null,"SA2. Reduce crime and the fear of crime ","Increases in racist and religious hate crimes.\n\nThe percentage of residents that are worried about crime in the Borough remains higher than the London average.\n\nNeed to provide safe and accessible environments where crime and disorder, and the fear of crime, do not undermine quality of life.\n\nNeed to develop an approach to tackling crime, improving liveability and reducing anti-social behaviour.","The policy aims to improve community safety and cohesion by designing out crime.\nIt promotes the design of new development to create safe environments and reduce crime and disorder. For example Criteria A of the policy requires all new development to incorporate principles and practises of 'Designing out Crime' and 'Secured by Design'. Criteria C of the policy promotes safer streets and public realm improvements throughout the Borough.  This fully supports the achievement of this objective and is therefore considered to have a significant positive effect.  ","Direct","Medium/ Long","Permanent/ Irreversible","Local/ High","Significant Positive",null,null,null,null,"N/A","Short/ Medium","Temporary/ Reversible",null,null,"Minor Negative"]
{"$rows_left_out":25}
{"sheet":"Summary table","index":8,"n_rows":9,"n_cols":31,"rows_kept":9,"cut":false,"hidden":true,"merged":[]}
[null,null,null,null,null,"I",5,6,7,8,9,10,11,12,13,14,15,16,17,18,19,20,21,22,23,24]
[null,null,null,null,null,"Policy Name","SA1","SA2","SA3","SA4","SA5","SA6","SA7","SA8","SA9","SA10","SA11","SA12","SA13","SA14","SA15","SA16","SA17","SA18","SA19","SA20"]
[4,{"$f":"INDEX(SheetNames,A3)","v":{"$error":"#NAME?"}},null,null,null,"Option 1 OAN",{"$f":"INDIRECT(\"'\"&$F3&\"'\"&\"!\"&$F$1&G$1)","v":0},{"$f":"INDIRECT(\"'\"&$F3&\"'\"&\"!\"&$F$1&H$1)","v":0},{"$f":"INDIRECT(\"'\"&$F3&\"'\"&\"!\"&$F$1&I$1)","v":0},{"$f":"INDIRECT(\"'\"&$F3&\"'\"&\"!\"&$F$1&J$1)","v":0},{"$f":"INDIRECT(\"'\"&$F3&\"'\"&\"!\"&$F$1&K$1)","v":0},{"$f":"INDIRECT(\"'\"&$F3&\"'\"&\"!\"&$F$1&L$1)","v":0},{"$f":"INDIRECT(\"'\"&$F3&\"'\"&\"!\"&$F$1&M$1)","v":0},{"$f":"INDIRECT(\"'\"&$F3&\"'\"&\"!\"&$F$1&N$1)","v":0},{"$f":"INDIRECT(\"'\"&$F3&\"'\"&\"!\"&$F$1&O$1)","v":0},{"$f":"INDIRECT(\"'\"&$F3&\"'\"&\"!\"&$F$1&P$1)","v":0},{"$f":"INDIRECT(\"'\"&$F3&\"'\"&\"!\"&$F$1&Q$1)","v":0},{"$f":"INDIRECT(\"'\"&$F3&\"'\"&\"!\"&$F$1&R$1)","v":0},{"$f":"INDIRECT(\"'\"&$F3&\"'\"&\"!\"&$F$1&S$1)","v":0},{"$f":"INDIRECT(\"'\"&$F3&\"'\"&\"!\"&$F$1&T$1)","v":0},{"$f":"INDIRECT(\"'\"&$F3&\"'\"&\"!\"&$F$1&U$1)","v":0},{"$f":"INDIRECT(\"'\"&$F3&\"'\"&\"!\"&$F$1&V$1)","v":0},{"$f":"INDIRECT(\"'\"&$F3&\"'\"&\"!\"&$F$1&W$1)","v":0},{"$f":"INDIRECT(\"'\"&$F3&\"'\"&\"!\"&$F$1&X$1)","v":0},{"$f":"INDIRECT(\"'\"&$F3&\"'\"&\"!\"&$F$1&Y$1)","v":0},{"$f":"INDIRECT(\"'\"&$F3&\"'\"&\"!\"&$F$1&Z$1)","v":0},null,{"$f":"#REF!","v":{"$error":"#REF!"}},null,"Significant positive","+ +"]
[5,{"$f":"INDEX(SheetNames,A4)","v":{"$error":"#NAME?"}},null,null,null,"Option 2 London Plan",{"$f":"INDIRECT(\"'\"&$F4&\"'\"&\"!\"&$F$1&G$1)","v":"Significant Negative"},{"$f":"INDIRECT(\"'\"&$F4&\"'\"&\"!\"&$F$1&H$1)","v":"Neutral"},{"$f":"INDIRECT(\"'\"&$F4&\"'\"&\"!\"&$F$1&I$1)","v":"Neutral"},{"$f":"INDIRECT(\"'\"&$F4&\"'\"&\"!\"&$F$1&J$1)","v":"Neutral"},{"$f":"INDIRECT(\"'\"&$F4&\"'\"&\"!\"&$F$1&K$1)","v":"Neutral"},{"$f":"INDIRECT(\"'\"&$F4&\"'\"&\"!\"&$F$1&L$1)","v":"Minor Negative"},{"$f":"INDIRECT(\"'\"&$F4&\"'\"&\"!\"&$F$1&M$1)","v":"Neutral"},{"$f":"INDIRECT(\"'\"&$F4&\"'\"&\"!\"&$F$1&N$1)","v":"Neutral"},{"$f":"INDIRECT(\"'\"&$F4&\"'\"&\"!\"&$F$1&O$1)","v":"Uncertain"},{"$f":"INDIRECT(\"'\"&$F4&\"'\"&\"!\"&$F$1&P$1)","v":"Neutral"},{"$f":"INDIRECT(\"'\"&$F4&\"'\"&\"!\"&$F$1&Q$1)","v":"Minor Positive"},{"$f":"INDIRECT(\"'\"&$F4&\"'\"&\"!\"&$F$1&R$1)","v":"Neutral"},{"$f":"INDIRECT(\"'\"&$F4&\"'\"&\"!\"&$F$1&S$1)","v":"Neutral"},{"$f":"INDIRECT(\"'\"&$F4&\"'\"&\"!\"&$F$1&T$1)","v":"Uncertain"},{"$f":"INDIRECT(\"'\"&$F4&\"'\"&\"!\"&$F$1&U$1)","v":"Neutral"},{"$f":"INDIRECT(\"'\"&$F4&\"'\"&\"!\"&$F$1&V$1)","v":"Neutral"},{"$f":"INDIRECT(\"'\"&$F4&\"'\"&\"!\"&$F$1&W$1)","v":"Neutral"},{"$f":"INDIRECT(\"'\"&$F4&\"'\"&\"!\"&$F$1&X$1)","v":"Significant Positive"},{"$f":"INDIRECT(\"'\"&$F4&\"'\"&\"!\"&$F$1&Y$1)","v":"Minor Positive"},{"$f":"INDIRECT(\"'\"&$F4&\"'\"&\"!\"&$F$1&Z$1)","v":"Minor Positive"},null,null,null,"Minor Positive","+"]
[]
[]
{"$rows_left_out":4}
{"sheet":"Summary","index":9,"n_rows":662,"n_cols":11,"rows_kept":662,"cut":false,"hidden":true,"merged":[]}
[]
[null,"Site Name","SA Obj.","Significant Positive","Significant Negative","Minor Positive","Minor Negative","Neutral","Uncertain","Overall ",0]
[null,"North Chingford",1,{"$f":"COUNTIF(INDIRECT(\"'\"&$B3&\"'!\"&$J3),\"Significant Positive\")","v":{"$error":"#VALUE!"}},{"$f":"COUNTIF(INDIRECT(\"'\"&$B3&\"'!\"&$J3),\"Significant Negative\")","v":{"$error":"#VALUE!"}},{"$f":"COUNTIF(INDIRECT(\"'\"&$B3&\"'!\"&$J3),\"Minor Positive\")","v":{"$error":"#VALUE!"}},{"$f":"COUNTIF(INDIRECT(\"'\"&$B3&\"'!\"&$J3),\"Minor Negative\")","v":{"$error":"#VALUE!"}},{"$f":"COUNTIF(INDIRECT(\"'\"&$B3&\"'!\"&$J3),\"Neutral\")","v":{"$error":"#VALUE!"}},{"$f":"COUNTIF(INDIRECT(\"'\"&$B3&\"'!\"&$J3),\"Uncertain\")","v":{"$error":"#VALUE!"}},"J8",{"$f":"IF(B3=B2,K2,K2+1)","v":1}]
[null,"North Chingford",2,{"$f":"COUNTIF(INDIRECT(\"'\"&$B4&\"'!\"&$J4),\"Significant Positive\")","v":{"$error":"#VALUE!"}},{"$f":"COUNTIF(INDIRECT(\"'\"&$B4&\"'!\"&$J4),\"Significant Negative\")","v":{"$error":"#VALUE!"}},{"$f":"COUNTIF(INDIRECT(\"'\"&$B4&\"'!\"&$J4),\"Minor Positive\")","v":{"$error":"#VALUE!"}},{"$error":"#VALUE!"},{"$f":"COUNTIF(INDIRECT(\"'\"&$B4&\"'!\"&$J4),\"Neutral\")","v":{"$error":"#VALUE!"}},{"$f":"COUNTIF(INDIRECT(\"'\"&$B4&\"'!\"&$J4),\"Uncertain\")","v":{"$error":"#VALUE!"}},"j9",{"$f":"IF(B4=B3,K3,K3+1)","v":1}]
[null,"North Chingford",3,{"$f":"COUNTIF(INDIRECT(\"'\"&$B5&\"'!\"&$J5),\"Significant Positive\")","v":{"$error":"#VALUE!"}},{"$error":"#VALUE!"},{"$error":"#VALUE!"},{"$error":"#VALUE!"},{"$error":"#VALUE!"},{"$error":"#VALUE!"},"j10",{"$f":"IF(B5=B4,K4,K4+1)","v":1}]
[null,"North Chingford",4,{"$error":"#VALUE!"},{"$error":"#VALUE!"},{"$error":"#VALUE!"},{"$error":"#VALUE!"},{"$error":"#VALUE!"},{"$error":"#VALUE!"},"j11",{"$f":"IF(B6=B5,K5,K5+1)","v":1}]
{"$rows_left_out":657}
{"sheet":"Pivot Chart","index":10,"n_rows":9,"n_cols":2,"rows_kept":9,"cut":false,"hidden":true,"merged":[]}
["Site Name","Thatched House NC"]
[]
["Values"]
["Sum of Uncertain",{"$error":"#REF!"}]
["Sum of Neutral",{"$error":"#REF!"}]
["Sum of Minor Negative",{"$error":"#REF!"}]
{"$rows_left_out":3}